{"text_format":"1","workbook":"xlsx","n_sheets":13,"sheets":["Datos del hotel","Información","Plan","Energía","Agua","Residuos","Deperdicio alimentario","Evaluación","HUELLA","DATOS","Datos y cálculos","Scale","Hoja1"],"not_rendered":{"charts":0,"images":0,"macros":1,"external_links":1,"defined_names":18,"comments":5,"pivot_tables":0},"unopened":[],"bounds":{"document_bytes":16777216,"sheet_cells":100000,"rows_first":2000,"rows_last":500,"rows_between":2000,"halvings":0,"cell_chars":16384,"cell_head_chars":4096},"cells_cut":0,"cells_raw":0,"read":"whole","date_system":"1900"}

{"sheet":"Datos del hotel","index":0,"n_rows":11,"n_cols":12,"rows_kept":11,"cut":false,"hidden":false,"merged":[[0,1,0,2],[1,1,1,2]]}
[null,"DATOS DEL HOTEL"]
[null,"DATOS"]
[null,"NOMBRE DEL HOTEL"]
["YEAR","NOMBRE DE LA EMPRESA"]
["SEM","CIF"]
["ID","DIRECCIÓN DEL HOTEL"]
[null,"CÓDIGO POSTAL"]
["D1","PROVINCIA"]
{"$rows_left_out":4}
{"sheet":"Información","index":1,"n_rows":19,"n_cols":12,"rows_kept":19,"cut":false,"hidden":false,"merged":[[0,1,0,2],[1,1,1,2]]}
[null,"ALOJAMIENTO – INFORMACIÓN GENÉRICA"]
[null,"DATOS"]
[null,"IDENTIFICACIÓN DEL ALOJAMIENTO",{"$f":"'Datos del hotel'!C3","v":0}]
["YEAR","AÑO (YEAR)"]
["SEM","SEMANAS APERTURA DEL HOTEL POR AÑO (SEM)"]
["ID","(CÓDIGO O NOMBRE) (ID)"]
["D1","PROVINCIA (D1)",{"$f":"'Datos del hotel'!C8","v":0}]
["D2","NÚMERO DE ESTRELLAS (D2)",null,null,"*","**","***","****","*****"]
{"$rows_left_out":12}
{"sheet":"Plan","index":2,"n_rows":56,"n_cols":6,"rows_kept":56,"cut":false,"hidden":false,"merged":[[0,1,0,2],[50,1,50,2],[44,1,44,2],[1,1,1,2],[8,1,8,2],[12,1,12,2],[26,1,26,2],[32,1,32,2],[36,1,36,2],[40,1,40,2],[45,1,45,2],[51,1,51,2],[35,1,35,2],[31,1,31,2],[11,1,11,2],[25,1,25,2]]}
[null,"PLANIFICACIÓN Y EVALUACIÓN CIRCULAR"]
[null,"DATOS"]
[null,"INVERSIÓN","VALORES"]
["P1B","Fracción de la inversión vinculada a buenas prácticas circulares[1] hecha por el establecimiento (% sobre la inversión total de los últimos 3 ejercicios) (P1B) "]
[null,"FORMACIÓN DE LA PLANTILLA","VALORES"]
["P2B","Plantilla que ha recibido formación relacionada con la circularidad (P2B) (% trabajadores que han recibido algún tipo de formación en circularidad en el último ejercicio)"]
[null,"COMPROMISO CIRCULAR DE PROVEEDORES","VALORES"]
["P3B","Proveedores que operan con un código de conducta circular (P3B) (% del total de proveedores que operan bajo prácticas circulares)"]
{"$rows_left_out":49}
{"sheet":"Energía","index":3,"n_rows":37,"n_cols":11,"rows_kept":37,"cut":false,"hidden":false,"merged":[[32,1,32,2],[0,1,0,2],[1,1,1,2],[11,1,11,2],[21,1,21,2]]}
[null,"ÁREA PRIORITARIA DE ENERGÍA"]
[null,"DATOS"]
[null,"HUELLA DE CARBONO","VALORES"]
["E1B","Huella de carbono anual (t CO2 eq. / año) (E1B)"]
[null,"CERTIFICACIONES ENERGÉTICAS","VALORES"]
["E2B","Certificación energética del edificio (E2B)",null,null,"A","B","C","D","E","F","G"]
[null,"PARÁMETROS ENERGÉTICOS","VALORES",null,1,0.83333333333333337,{"$f":"4/6","v":0.66666666666666663},{"$f":"3/6","v":0.5},{"$f":"2/6","v":0.33333333333333331},{"$f":"1/6","v":0.16666666666666666},0]
["E3B","Capacidad de autoabastecimiento de energía (E3B) (% energía autogenerada/ autoconsumida de fuentes renovables respecto al total de energía consumida al año en el establecimiento)"]
{"$rows_left_out":30}
{"sheet":"Agua","index":4,"n_rows":15,"n_cols":6,"rows_kept":15,"cut":false,"hidden":false,"merged":[[0,1,0,2],[6,1,6,2],[1,1,1,2]]}
[null,"ÁREA PRIORITARIA DE AGUA"]
[null,"DATOS"]
[null,"CONSUMO Y CAPACIDAD","VALORES"]
["A1B","Capacidad de autoabastecimiento de agua (A1B). (% volumen de agua autocaptada y/o depurada respecto al total de agua en el establecimiento y en las instalaciones del mismo)"]
["A2B","Consumo anual de agua (proveniente de la red pública) (A2B) (L/año)"]
[null,"GESTIÓN Y CONSUMO RESPONSABLE DE AGUA"]
[null,"ACTUACIONES"]
[null,"ESTRATEGÍA Y PLANIFICACIÓN DE LA GESTIÓN DE AGUA","Sí/No"]
{"$rows_left_out":8}
{"sheet":"Residuos","index":5,"n_rows":49,"n_cols":10,"rows_kept":49,"cut":false,"hidden":false,"merged":[[31,1,31,2],[0,1,0,2],[1,1,1,2],[6,1,6,2],[15,1,15,2],[27,1,27,2]]}
[null,"ÁREA PRIORITARIA DE MATERIALES Y RESIDUOS"]
[null,"DATOS"]
[null,"JERARQUÍA DE RESIDUOS","CÁLCULOS "]
["R1B","Recogida selectiva de residuos (R1B) (m3/noche) (Volumen estimado, por pernoctación, de residuos recogidos selectivamente —suma de las fracciones de papel y cartón, vidrio, envases, entre otros—)",{"$f":"SUM(C10:C14/365)","v":0}]
["R2B","Reciclaje de residuos de obras, reformas y demoliciones (R2B) (% de residuos reciclados de obras, reformas y demoliciones respecto al total de residuos de construcciones y demoliciones generados durante el último ejercicio, o, en su defecto, durante el último proyecto de obra)"]
[null,"SOSTENIBILIDAD Y GESTIÓN DE RESIDUOS"]
[null,"DATOS",null,null,"Sí","No"]
[null,"RESIDUOS GENERADOS EN EL ALOJAMIENTO","CÁLCULOS "]
{"$rows_left_out":42}
{"sheet":"Deperdicio alimentario","index":6,"n_rows":20,"n_cols":6,"rows_kept":20,"cut":false,"hidden":false,"merged":[[0,1,0,2],[1,1,1,2],[5,1,5,2],[6,1,6,2],[10,1,10,2]]}
[null,"ÁREA PRIORITARIA DE ALIMENTOS"]
[null,"DATOS"]
[null,"GASTO EN COMPRA SOSTENIBLE","VALORES"]
["RA1B","Consumo de productos de kilómetro cero[1](RA1B) (% sobre el total de gasto en alimentos y bebidas del establecimiento)"]
["RA2B","Cesta de la compra que minimiza el uso de envases (RA2B)  (% que representan los productos a granel y/o con envases reutilizables/ biodegradables sobre el total de partidas de gasto de aprovisionamientos del establecimiento)"]
[null,"ORIGEN DE LOS PRODUCTOS ALIMENTARIOS Y REDUCCIÓN DEL DESPERDICIO DE ALIMENTOS"]
[null,"DATOS",null,null,"Sí","No"]
[null,"ALIMENTOS NOS CONSUMIDOS","Sí/No y VALOR"]
{"$rows_left_out":13}
{"sheet":"Evaluación","index":7,"n_rows":44,"n_cols":17,"rows_kept":44,"cut":false,"hidden":false,"merged":[[0,0,0,4]]}
["EVALUACIÓN ECONOMÍQA CIRCULAR"]
[null,null,null,null,null,null,null,null,null,null,null,2,3,4,5,6,12]
["PLANIFICACIÓN Y EVALUACIÓN CIRCULAR","INDICADOR","VALOR INDICADOR","PUNTUACIÓN ASIGNADA","EVALUACIÓN",null,null,null,null,null,null,"Min","Bajo","Medio","Alto","Max","Puntuación max"]
["INVERSIÓN","P1B",{"$f":"HLOOKUP(B4,'Datos y cálculos'!$A$1:$FI$2,2,FALSE)","v":0},{"$f":"IF(C4<L4,0,IF(C4<P4,ABS((C4-L4)*Q4/(P4-L4)),Q4))","v":0},{"$f":"IF(C4<M4,\"Bajo\",IF(C4<N4,\"Medio\",IF(C4<O4,\"Alto\",\"Muy Alto\")))","v":"Bajo"},null,null,null,null,null,null,{"$f":"VLOOKUP($B4,Scale!$A$2:$L$32,L$2,FALSE)","v":0},{"$f":"VLOOKUP($B4,Scale!$A$2:$L$32,M$2,FALSE)","v":10},{"$f":"VLOOKUP($B4,Scale!$A$2:$L$32,N$2,FALSE)","v":20},{"$f":"VLOOKUP($B4,Scale!$A$2:$L$32,O$2,FALSE)","v":30},{"$f":"VLOOKUP($B4,Scale!$A$2:$L$32,P$2,FALSE)","v":40},{"$f":"VLOOKUP($B4,Scale!$A$2:$L$32,Q$2,FALSE)","v":4}]
["FORMACIÓN DE LA PLANTILLA","P2B",{"$f":"HLOOKUP(B5,'Datos y cálculos'!$A$1:$FI$2,2,FALSE)","v":0},{"$f":"IF(C5<L5,0,IF(C5<P5,ABS((C5-L5)*Q5/(P5-L5)),Q5))","v":0},"Bajo",null,null,null,null,null,null,{"$f":"VLOOKUP($B5,Scale!$A$2:$L$32,L$2,FALSE)","v":0},{"$f":"VLOOKUP($B5,Scale!$A$2:$L$32,M$2,FALSE)","v":25},{"$f":"VLOOKUP($B5,Scale!$A$2:$L$32,N$2,FALSE)","v":50},{"$f":"VLOOKUP($B5,Scale!$A$2:$L$32,O$2,FALSE)","v":75},{"$f":"VLOOKUP($B5,Scale!$A$2:$L$32,P$2,FALSE)","v":100},{"$f":"VLOOKUP($B5,Scale!$A$2:$L$32,Q$2,FALSE)","v":1}]
["COMPROMISO CIRCULAR DE PROVEEDORES","P3B",{"$f":"HLOOKUP(B6,'Datos y cálculos'!$A$1:$FI$2,2,FALSE)","v":0},{"$f":"IF(C6<L6,0,IF(C6<P6,ABS((C6-L6)*Q6/(P6-L6)),Q6))","v":0},"Bajo",null,null,null,null,null,null,{"$f":"VLOOKUP($B6,Scale!$A$2:$L$32,L$2,FALSE)","v":0},{"$f":"VLOOKUP($B6,Scale!$A$2:$L$32,M$2,FALSE)","v":25},{"$f":"VLOOKUP($B6,Scale!$A$2:$L$32,N$2,FALSE)","v":50},{"$f":"VLOOKUP($B6,Scale!$A$2:$L$32,O$2,FALSE)","v":75},{"$f":"VLOOKUP($B6,Scale!$A$2:$L$32,P$2,FALSE)","v":100},{"$f":"VLOOKUP($B6,Scale!$A$2:$L$32,Q$2,FALSE)","v":1}]
["ACTUACIONES","PBP",{"$f":"HLOOKUP(B7,'Datos y cálculos'!$A$1:$FI$2,2,FALSE)","v":0},{"$f":"IF(C7<L7,0,IF(C7<P7,ABS((C7-L7)*Q7/(P7-L7)),Q7))","v":0},{"$f":"IF(C7<M7,\"Bajo\",IF(C7<N7,\"Medio\",IF(C7<O7,\"Alto\",\"Muy Alto\")))","v":"Bajo"},null,null,null,null,null,null,{"$f":"VLOOKUP($B7,Scale!$A$2:$L$32,L$2,FALSE)","v":0},{"$f":"VLOOKUP($B7,Scale!$A$2:$L$32,M$2,FALSE)","v":4.75},{"$f":"VLOOKUP($B7,Scale!$A$2:$L$32,N$2,FALSE)","v":9.5},{"$f":"VLOOKUP($B7,Scale!$A$2:$L$32,O$2,FALSE)","v":14.25},{"$f":"VLOOKUP($B7,Scale!$A$2:$L$32,P$2,FALSE)","v":19},{"$f":"VLOOKUP($B7,Scale!$A$2:$L$32,Q$2,FALSE)","v":14}]
[]
{"$rows_left_out":37}
{"sheet":"HUELLA","index":8,"n_rows":99,"n_cols":11,"rows_kept":99,"cut":false,"hidden":false,"merged":[[80,1,80,5],[1,2,1,10],[67,2,67,10],[18,1,18,10],[32,1,32,10],[51,1,51,9],[70,1,70,5],[4,1,4,10],[52,8,53,8],[52,9,53,9],[71,1,72,1],[71,2,72,2],[71,3,72,3],[71,4,72,4],[71,5,72,5],[52,1,53,1],[81,1,82,1],[81,2,82,2],[81,3,82,3],[81,4,82,4],[81,5,82,5],[52,2,53,2],[52,3,53,3],[52,4,52,5],[52,6,53,6],[52,7,53,7],[33,2,35,2],[33,3,35,3],[33,4,33,6],[33,7,34,9],[33,10,35,10],[34,4,34,6],[19,10,21,10],[20,4,20,6],[5,1,7,1],[5,2,7,2],[5,3,7,3],[5,4,5,6],[5,7,6,9],[5,10,7,10],[6,4,6,6],[19,1,21,1],[19,2,21,2],[19,3,21,3],[19,4,19,6],[19,7,20,9]]}
[]
[null,"ALCANCE 1: EMISIONES DIRECTAS","CONSUMOS DE FLOTA DE VEHICULOS DE COMBUSTIÓN, INSTALACIONES FIJAS Y FUGITIVAS"]
[]
[]
[null,"EMISIONES DE LA FLOTA DE VEHÍCULOS DE COMBUSTIÓN POR CANTIDAD DE COMBUSTIBLE CONSUMIDA AL AÑO"]
[null,"Categoría de vehículo","Tipo de Combustible","Cantidad comb. (ud)","Factor emisión",null,null,"Emisiones parciales",null,null,"Emisiones \ntotales\nkg CO2e"]
[null,null,null,null,"Por defecto"]
[null,null,null,null,"CO2 (kg/ud)","CH4 (g/ud)","N2O (g/ud)","kg CO2","g CH4","g N2O"]
{"$rows_left_out":92}
{"sheet":"DATOS","index":9,"n_rows":328,"n_cols":12,"rows_kept":328,"cut":false,"hidden":true,"merged":[[0,2,0,6],[1,1,1,3],[38,1,38,3],[134,2,134,7]]}
[null,"ALCANCE 1","CONSUMOS DE FLOTA DE VEHICULOS DE COMBUSTIÓN E INSTALACIONES FIJAS",null,null,null,null,null,"GWP 5th AR"]
[null,"FACTORES DE EMISIÓN VEHICULOS FLOTA (POR ud)",null,null,2022,2022,2022,null,"CH4",28]
[null,"TIPO CONBUSTIBLE","TIPO DE VEHÍCULO","CONCAT","CO2 (kg/ud)","CH4 (g/ud)","N2O (g/ud)",null,"N2O",265]
["GASOLINA","E5 (l)","Turismos (M1)",{"$f":"B4&C4","v":"E5 (l)Turismos (M1)"},2.2360000000000002,0.245,2.5999999999999999E-2]
[null,"E5 (l)","Furgonetas y furgones (N1)","E5 (l)Furgonetas y furgones (N1)",2.234,0.59799999999999998,5.5E-2,null,"LISTA TIPO COMBUSTIBLE",{"$f":"10732.8+(1176*(J2/1000))+(124.8*(J3/1000))","v":10798.8}]
[null,"E5 (l)","Camiones y autobuses (N2, N3, M2, M3)","E5 (l)Camiones y autobuses (N2, N3, M2, M3)",2.234,0.48799999999999999,2.1000000000000001E-2,null,"B10 (l)"]
[null,"E5 (l)","Ciclomotores y motocicletas (L)","E5 (l)Ciclomotores y motocicletas (L)",2.27,2.1629999999999998,4.4999999999999998E-2,null,"B100 (l)"]
[null,"E10 (l)","Turismos (M1)","E10 (l)Turismos (M1)",2.1190000000000002,0.245,2.5999999999999999E-2,null,"B20 (l)"]
{"$rows_left_out":321}
{"sheet":"Datos y cálculos","index":10,"n_rows":4,"n_cols":165,"rows_kept":4,"cut":false,"hidden":true,"merged":[]}
["ID","YEAR","SEM","D1","D2","D3","D4","D5","D6","D7","D8","D9","D10","D11","D12","D13","P1B","P2B","P3B","PBP1","PBP2","PBP3","PBP4","PBP5","PBP6","PBP7","PBP8","PBP9","PBP10","PBP11","PBP12","PBP13","PBP14","PBP15","PBP16","PBP17","PBP18","PBP19","E1B","E2B","E3B","E4B","E5B","E6","E7","E8","E9","E10","E11","E12","EBP1","E13","EBP21","EBP22","EBP3","EBP4","EBP5","EBP61","EBP62","EBP7","A1B","A2B","ABP1","ABP2","ABP3","ABP41","ABP42","ABP5","R1B","R2B","R1","R2","R3","R4","R5","R6","RBP1","RBP2","RBP3","RBP41","RBP42","RBP43","RBP44","RBP45","RBP5","RBP6","RBP7","RBP8","RBP9","RA1B","RA2B","RABP1","RABP11","RABP2","RABP3","RABP4","RABP5","RABP6","PBP","E2B_val","EI","EBP","E1B1","E1B2","E1B3","E3B1","E3B2","E3B3","E61","E71","E81","E62","E72","E82","E63","E73","E83","A1B1","A1B2","A1B3","A2B1","A2B2","A2B3","ABP","R1P","R2P","R3P","R4P","R5P","R6P","R1F","R2F","R3F","R4F","R5F","R6F","R1FP","R2FP","R3FP","R4FP","R5FP","R6FP","RVal","R11","R21","R31","R41","R51","R61","R12","R22","R32","R42","R52","R62","R13","R23","R33","R43","R53","R63","RTot","RTotP","RBP","RABP"]
[{"$f":"VLOOKUP(A1,Información!$A$3:$C$19,3,FALSE)","v":0},{"$f":"VLOOKUP(B1,Información!$A$3:$C$19,3,FALSE)","v":0},{"$f":"VLOOKUP(C1,Información!$A$3:$C$19,3,FALSE)","v":0},{"$f":"VLOOKUP(D1,Información!$A$3:$C$19,3,FALSE)","v":0},{"$f":"VLOOKUP(E1,Información!$A$3:$C$19,3,FALSE)","v":0},{"$f":"VLOOKUP(F1,Información!$A$3:$C$19,3,FALSE)","v":0},{"$f":"VLOOKUP(G1,Información!$A$3:$C$19,3,FALSE)","v":0},{"$f":"VLOOKUP(H1,Información!$A$3:$C$19,3,FALSE)","v":0},{"$f":"VLOOKUP(I1,Información!$A$3:$C$19,3,FALSE)","v":0},{"$f":"VLOOKUP(J1,Información!$A$3:$C$19,3,FALSE)","v":0},{"$f":"VLOOKUP(K1,Información!$A$3:$C$19,3,FALSE)","v":0},{"$f":"VLOOKUP(L1,Información!$A$3:$C$19,3,FALSE)","v":0},{"$f":"VLOOKUP(M1,Información!$A$3:$C$19,3,FALSE)","v":0},{"$f":"VLOOKUP(N1,Información!$A$3:$C$19,3,FALSE)","v":0},{"$f":"VLOOKUP(O1,Información!$A$3:$C$19,3,FALSE)","v":0},{"$f":"VLOOKUP(P1,Información!$A$3:$C$19,3,FALSE)","v":0},{"$f":"VLOOKUP(Q1,Plan!$A$4:$C$56,3,FALSE)","v":0},{"$f":"VLOOKUP(R1,Plan!$A$4:$C$56,3,FALSE)","v":0},{"$f":"VLOOKUP(S1,Plan!$A$4:$C$56,3,FALSE)","v":0},{"$f":"IF(VLOOKUP(T1,Plan!$A$4:$C$56,3,FALSE)=\"Sí\",1,0)","v":0},{"$f":"IF(VLOOKUP(U1,Plan!$A$4:$C$56,3,FALSE)=\"Sí\",1,0)","v":0},{"$f":"IF(VLOOKUP(V1,Plan!$A$4:$C$56,3,FALSE)=\"Sí\",1,0)","v":0},{"$f":"IF(VLOOKUP(W1,Plan!$A$4:$C$56,3,FALSE)=\"Sí\",1,0)","v":0},{"$f":"IF(VLOOKUP(X1,Plan!$A$4:$C$56,3,FALSE)=\"Sí\",1,0)","v":0},{"$f":"IF(VLOOKUP(Y1,Plan!$A$4:$C$56,3,FALSE)=\"Sí\",1,0)","v":0},{"$f":"IF(VLOOKUP(Z1,Plan!$A$4:$C$56,3,FALSE)=\"Sí\",1,0)","v":0},{"$f":"IF(VLOOKUP(AA1,Plan!$A$4:$C$56,3,FALSE)=\"Sí\",1,0)","v":0},{"$f":"IF(VLOOKUP(AB1,Plan!$A$4:$C$56,3,FALSE)=\"Sí\",1,0)","v":0},{"$f":"IF(VLOOKUP(AC1,Plan!$A$4:$C$56,3,FALSE)=\"Sí\",1,0)","v":0},{"$f":"IF(VLOOKUP(AD1,Plan!$A$4:$C$56,3,FALSE)=\"Sí\",1,0)","v":0},{"$f":"IF(VLOOKUP(AE1,Plan!$A$4:$C$56,3,FALSE)=\"Sí\",1,0)","v":0},{"$f":"IF(VLOOKUP(AF1,Plan!$A$4:$C$56,3,FALSE)=\"Sí\",1,0)","v":0},{"$f":"IF(VLOOKUP(AG1,Plan!$A$4:$C$56,3,FALSE)=\"Sí\",1,0)","v":0},{"$f":"IF(VLOOKUP(AH1,Plan!$A$4:$C$56,3,FALSE)=\"Sí\",1,0)","v":0},{"$f":"IF(VLOOKUP(AI1,Plan!$A$4:$C$56,3,FALSE)=\"Sí\",1,0)","v":0},{"$f":"IF(VLOOKUP(AJ1,Plan!$A$4:$C$56,3,FALSE)=\"Sí\",1,0)","v":0},{"$f":"IF(VLOOKUP(AK1,Plan!$A$4:$C$56,3,FALSE)=\"Sí\",1,0)","v":0},{"$f":"IF(VLOOKUP(AL1,Plan!$A$4:$C$56,3,FALSE)=\"Sí\",1,0)","v":0},{"$f":"VLOOKUP(AM1,Energía!$A$4:$C$37,3,FALSE)","v":0},{"$f":"VLOOKUP(AN1,Energía!$A$4:$C$37,3,FALSE)","v":0},{"$f":"VLOOKUP(AO1,Energía!$A$4:$C$37,3,FALSE)","v":0},{"$f":"VLOOKUP(AP1,Energía!$A$4:$C$37,3,FALSE)","v":0},{"$f":"VLOOKUP(AQ1,Energía!$A$4:$C$37,3,FALSE)","v":0},{"$f":"VLOOKUP(AR1,Energía!$A$4:$C$37,3,FALSE)","v":0},{"$f":"VLOOKUP(AS1,Energía!$A$4:$C$37,3,FALSE)","v":0},{"$f":"VLOOKUP(AT1,Energía!$A$4:$C$37,3,FALSE)","v":0},{"$f":"VLOOKUP(AU1,Energía!$A$4:$C$37,3,FALSE)","v":0},{"$f":"VLOOKUP(AV1,Energía!$A$4:$C$37,3,FALSE)","v":0},{"$f":"VLOOKUP(AW1,Energía!$A$4:$C$37,3,FALSE)","v":0},{"$f":"VLOOKUP(AX1,Energía!$A$4:$C$37,3,FALSE)","v":0},{"$f":"IF(VLOOKUP(AY1,Energía!$A$4:$C$37,3,FALSE)=\"Si\",1,0)","v":0},{"$f":"VLOOKUP(AZ1,Energía!$A$4:$C$37,3,FALSE)","v":0},{"$f":"IF(VLOOKUP(BA1,Energía!$A$4:$C$37,3,FALSE)=\"Sí\",1,0)","v":0},{"$f":"IF(VLOOKUP(BB1,Energía!$A$4:$C$37,3,FALSE)=\"Sí\",1,0)","v":0},{"$f":"IF(VLOOKUP(BC1,Energía!$A$4:$C$37,3,FALSE)=\"Sí\",1,0)","v":0},{"$f":"IF(VLOOKUP(BD1,Energía!$A$4:$C$37,3,FALSE)=\"Sí\",1,0)","v":0},{"$f":"IF(VLOOKUP(BE1,Energía!$A$4:$C$37,3,FALSE)=\"Sí\",1,0)","v":0},{"$f":"IF(VLOOKUP(BF1,Energía!$A$4:$C$37,3,FALSE)=\"Sí\",1,0)","v":0},{"$f":"IF(VLOOKUP(BG1,Energía!$A$4:$C$37,3,FALSE)=\"Sí\",1,0)","v":0},{"$f":"IF(VLOOKUP(BH1,Energía!$A$4:$C$37,3,FALSE)=\"Sí\",1,0)","v":0},{"$f":"VLOOKUP(BI1,Agua!$A$4:$C$15,3,FALSE)","v":0},{"$f":"VLOOKUP(BJ1,Agua!$A$4:$C$15,3,FALSE)","v":0},{"$f":"IF(VLOOKUP(BK1,Agua!$A$4:$C$15,3,FALSE)=\"Sí\",1,0)","v":0},{"$f":"IF(VLOOKUP(BL1,Agua!$A$4:$C$15,3,FALSE)=\"Sí\",1,0)","v":0},{"$f":"IF(VLOOKUP(BM1,Agua!$A$4:$C$15,3,FALSE)=\"Sí\",1,0)","v":0},{"$f":"IF(VLOOKUP(BN1,Agua!$A$4:$C$15,3,FALSE)=\"Sí\",1,0)","v":0},{"$f":"IF(VLOOKUP(BO1,Agua!$A$4:$C$15,3,FALSE)=\"Sí\",1,0)","v":0},{"$f":"IF(VLOOKUP(BP1,Agua!$A$4:$C$15,3,FALSE)=\"Sí\",1,0)","v":0},{"$f":"VLOOKUP(BQ1,Residuos!$A$4:$C$34,3,FALSE)","v":0},{"$f":"Residuos!C5","v":0},{"$f":"VLOOKUP(BS1,Residuos!$A$4:$C$34,3,FALSE)","v":0},{"$f":"VLOOKUP(BT1,Residuos!$A$4:$C$34,3,FALSE)","v":0},{"$f":"VLOOKUP(BU1,Residuos!$A$4:$C$34,3,FALSE)","v":0},{"$f":"VLOOKUP(BV1,Residuos!$A$4:$C$34,3,FALSE)","v":0},{"$f":"VLOOKUP(BW1,Residuos!$A$4:$C$34,3,FALSE)","v":0},{"$f":"VLOOKUP(BX1,Residuos!$A$4:$C$34,3,FALSE)","v":0},{"$f":"IF(VLOOKUP(BY1,Residuos!$A$4:$C$34,3,FALSE)=\"Sí\",1,0)","v":0},{"$f":"IF(VLOOKUP(BZ1,Residuos!$A$4:$C$34,3,FALSE)=\"Sí\",1,0)","v":0},{"$f":"IF(VLOOKUP(CA1,Residuos!$A$4:$C$34,3,FALSE)=\"Sí\",1,0)","v":0},{"$f":"IF(VLOOKUP(CB1,Residuos!$A$4:$C$34,3,FALSE)=\"Sí\",1,0)","v":0},{"$f":"IF(VLOOKUP(CC1,Residuos!$A$4:$C$34,3,FALSE)=\"Sí\",1,0)","v":0},{"$f":"IF(VLOOKUP(CD1,Residuos!$A$4:$C$34,3,FALSE)=\"Sí\",1,0)","v":0},{"$f":"IF(VLOOKUP(CE1,Residuos!$A$4:$C$34,3,FALSE)=\"Sí\",1,0)","v":0},{"$f":"IF(VLOOKUP(CF1,Residuos!$A$4:$C$34,3,FALSE)=\"Sí\",1,0)","v":0},{"$f":"IF(VLOOKUP(CG1,Residuos!$A$4:$C$34,3,FALSE)=\"Sí\",1,0)","v":0},{"$f":"IF(VLOOKUP(CH1,Residuos!$A$4:$C$34,3,FALSE)=\"Sí\",1,0)","v":0},{"$f":"IF(VLOOKUP(CI1,Residuos!$A$4:$C$34,3,FALSE)=\"Sí\",1,0)","v":0},{"$f":"IF(VLOOKUP(CJ1,Residuos!$A$4:$C$34,3,FALSE)=\"Sí\",1,0)","v":0},{"$f":"IF(VLOOKUP(CK1,Residuos!$A$4:$C$34,3,FALSE)=\"Sí\",1,0)","v":0},{"$f":"VLOOKUP(CL1,'Deperdicio alimentario'!$A$4:$C$20,3,FALSE)","v":0},{"$f":"VLOOKUP(CM1,'Deperdicio alimentario'!$A$4:$C$20,3,FALSE)","v":0},{"$f":"IF(VLOOKUP(CN1,'Deperdicio alimentario'!$A$4:$C$20,3,FALSE)=\"Sí\",1,0)","v":0},{"$f":"IF(VLOOKUP(CO1,'Deperdicio alimentario'!$A$4:$C$20,3,FALSE)=\"Sí\",1,0)","v":0},{"$f":"IF(VLOOKUP(CP1,'Deperdicio alimentario'!$A$4:$C$20,3,FALSE)=\"Sí\",1,0)","v":0},{"$f":"IF(VLOOKUP(CQ1,'Deperdicio alimentario'!$A$4:$C$20,3,FALSE)=\"Sí\",1,0)","v":0},{"$f":"IF(VLOOKUP(CR1,'Deperdicio alimentario'!$A$4:$C$20,3,FALSE)=\"Sí\",1,0)","v":0},{"$f":"IF(VLOOKUP(CS1,'Deperdicio alimentario'!$A$4:$C$20,3,FALSE)=\"Sí\",1,0)","v":0},{"$f":"IF(VLOOKUP(CT1,'Deperdicio alimentario'!$A$4:$C$20,3,FALSE)=\"Sí\",1,0)","v":0},{"$f":"SUM(T2:AL2)","v":0},{"$f":"HLOOKUP('Datos y cálculos'!AN2,Energía!$E$6:$K$7,2,FALSE)","v":{"$error":"#N/A"}},{"$f":"(HLOOKUP(AU2,Energía!$E$6:$K$7,2,FALSE)+HLOOKUP(AV2,Energía!$E$6:$K$7,2,FALSE)+HLOOKUP(AW2,Energía!$E$6:$K$7,2,FALSE)+HLOOKUP(AX2,Energía!$E$6:$K$7,2,FALSE))/4","v":{"$error":"#N/A"}},{"$f":"SUM(BA2:BH2)+AY2","v":0},{"$f":"AM2*1000/N2","v":{"$error":"#DIV/0!"}},{"$f":"AM2*1000/O2","v":{"$error":"#DIV/0!"}},{"$f":"AM2*1000/L2","v":{"$error":"#DIV/0!"}},{"$f":"(AO2*AR2/100)*1000/N2","v":{"$error":"#DIV/0!"}},{"$f":"(AO2*AR2/100)*1000/O2","v":{"$error":"#DIV/0!"}},{"$f":"(AO2*AR2/100)*1000/L2","v":{"$error":"#DIV/0!"}},{"$f":"AR2*1000/N2","v":{"$error":"#DIV/0!"}},{"$f":"AS2*1000/N2","v":{"$error":"#DIV/0!"}},{"$f":"AT2*1000/N2","v":{"$error":"#DIV/0!"}},{"$f":"AR2*1000/O2","v":{"$error":"#DIV/0!"}},{"$f":"AS2*1000/O2","v":{"$error":"#DIV/0!"}},{"$f":"AT2*1000/O2","v":{"$error":"#DIV/0!"}},{"$f":"AR2*1000/L2","v":{"$error":"#DIV/0!"}},{"$f":"AS2*1000/L2","v":{"$error":"#DIV/0!"}},{"$f":"AT2*1000/L2","v":{"$error":"#DIV/0!"}},{"$f":"(BI2*BJ2/100)/N2","v":{"$error":"#DIV/0!"}},{"$f":"(BI2*BJ2/100)/O2","v":{"$error":"#DIV/0!"}},{"$f":"(BI2*BJ2/100)/L2","v":{"$error":"#DIV/0!"}},{"$f":"BJ2/N2","v":{"$error":"#DIV/0!"}},{"$f":"BJ2/O2","v":{"$error":"#DIV/0!"}},{"$f":"BJ2/L2","v":{"$error":"#DIV/0!"}},{"$f":"SUM(BK2:BP2)","v":0},{"$f":"BS2","v":0},0,0,0,0,0,{"$f":"BS2*100/SUM($BS$2:$BX$2)","v":{"$error":"#DIV/0!"}},{"$error":"#DIV/0!"},{"$error":"#DIV/0!"},{"$error":"#DIV/0!"},{"$error":"#DIV/0!"},{"$error":"#DIV/0!"},{"$f":"DU2*100/SUM($DU$2:$DZ$2)","v":{"$error":"#DIV/0!"}},{"$f":"DV2*100/SUM($DU$2:$DZ$2)","v":{"$error":"#DIV/0!"}},{"$error":"#DIV/0!"},{"$error":"#DIV/0!"},{"$error":"#DIV/0!"},{"$error":"#DIV/0!"},{"$f":"100-EF2","v":{"$error":"#DIV/0!"}},{"$f":"BS2*1000/$N$2","v":{"$error":"#DIV/0!"}},{"$error":"#DIV/0!"},{"$error":"#DIV/0!"},{"$error":"#DIV/0!"},{"$error":"#DIV/0!"},{"$error":"#DIV/0!"},{"$f":"BS2*1000/$O$2","v":{"$error":"#DIV/0!"}},{"$error":"#DIV/0!"},{"$error":"#DIV/0!"},{"$error":"#DIV/0!"},{"$error":"#DIV/0!"},{"$error":"#DIV/0!"},{"$f":"BS2*1000/$L$2","v":{"$error":"#DIV/0!"}},{"$error":"#DIV/0!"},{"$error":"#DIV/0!"},{"$error":"#DIV/0!"},{"$error":"#DIV/0!"},{"$error":"#DIV/0!"},{"$f":"SUM(BS2:BX2)","v":0},{"$f":"SUM(DU2:DZ2)","v":0},{"$f":"SUM(BY2:CK2)","v":0},{"$f":"SUM(CN2:CT2)","v":0}]
["Hotel Pepe",2023,52,"Valencia","*","Complejo turístico/ resort – Nivel superior","Urbano – en el centro de la ciudad","Gestión de la cadena","Cadenas de lujo","Todo el año","Propio",2000,90,19000,17000,20,5,35,10,1,0,1,1,1,1,1,1,1,1,1,1,1,1,1,1,0,1,1,27.03,"A",100,100,0,320000,0,200000,"C","F","A","C",1,1000000,1,1,1,1,1,0,0,0,33,8480000,0,1,1,0,1,1,2.137,0,52,156,260,104,208,936,1,1,0,0,0,1,0,0,0,0,0,0,0,20,10,0,0,0,1,0,0,0,17,1,0.625,6,1.422631578947368,1.59,13.515000000000001,16842.10526315789,18823.52941176471,160000,16842.10526315789,0,10526.315789473691,18823.52941176471,0,11764.705882352941,160000,0,100000,147.2842105263158,164.61176470588239,1399.2,446.31578947368422,498.8235294117647,4240,4,null,null,null,null,null,null,3.0303030303030298,9.0909090909090917,15.15151515151515,6.0606060606060614,12.121212121212119,54.545454545454547,null,null,null,null,null,null,45.454545454545453,2.736842105263158,8.2105263157894743,13.684210526315789,5.4736842105263159,10.94736842105263,49.263157894736842,3.0588235294117641,9.1764705882352935,15.294117647058821,6.117647058823529,12.23529411764706,55.058823529411768,26,78,130,52,104,468,1716,null,3,1]
[null,null,null,null,null,null,null,null,null,null,null,{"$f":"L2-L3","v":-2000},{"$f":"M2-M3","v":-90},-19000,-17000,-20,-5,-35,-10,-1,0,-1,-1,-1,-1,-1,-1,-1,-1,-1,-1,-1,-1,-1,-1,0,-1,-1,-27.03,{"$error":"#VALUE!"},-100,-100,0,-320000,0,-200000,{"$error":"#VALUE!"},{"$error":"#VALUE!"},{"$error":"#VALUE!"},{"$error":"#VALUE!"},-1,-1000000,-1,-1,-1,-1,-1,0,0,0,-33,-8480000,0,-1,-1,0,-1,-1,-2.137,{"$f":"BR2-BR3","v":0},{"$f":"BS2-BS3","v":-52},{"$f":"BT2-BT3","v":-156},{"$f":"BU2-BU3","v":-260},{"$f":"BV2-BV3","v":-104},{"$f":"BW2-BW3","v":-208},{"$f":"BX2-BX3","v":-936},{"$f":"BY2-BY3","v":-1},{"$f":"BZ2-BZ3","v":-1},{"$f":"CA2-CA3","v":0},{"$f":"CB2-CB3","v":0},{"$f":"CC2-CC3","v":0},-1,0,0,0,0,0,0,0,-20,-10,0,0,0,-1,0,0,0,-17,{"$error":"#N/A"},{"$error":"#N/A"},-6,{"$error":"#DIV/0!"},{"$error":"#DIV/0!"},{"$error":"#DIV/0!"},{"$error":"#DIV/0!"},{"$error":"#DIV/0!"},{"$error":"#DIV/0!"},{"$error":"#DIV/0!"},{"$error":"#DIV/0!"},{"$error":"#DIV/0!"},{"$error":"#DIV/0!"},{"$error":"#DIV/0!"},{"$error":"#DIV/0!"},{"$error":"#DIV/0!"},{"$error":"#DIV/0!"},{"$error":"#DIV/0!"},{"$f":"DN2-DN3","v":{"$error":"#DIV/0!"}},{"$error":"#DIV/0!"},{"$error":"#DIV/0!"},{"$error":"#DIV/0!"},{"$error":"#DIV/0!"},{"$error":"#DIV/0!"},-4,0,0,0,0,0,0,{"$error":"#DIV/0!"},{"$error":"#DIV/0!"},{"$error":"#DIV/0!"},{"$error":"#DIV/0!"},{"$error":"#DIV/0!"},{"$error":"#DIV/0!"},{"$error":"#DIV/0!"},{"$error":"#DIV/0!"},{"$error":"#DIV/0!"},{"$error":"#DIV/0!"},{"$error":"#DIV/0!"},{"$error":"#DIV/0!"},{"$error":"#DIV/0!"},{"$error":"#DIV/0!"},{"$error":"#DIV/0!"},{"$f":"EP2-EP3","v":{"$error":"#DIV/0!"}},{"$error":"#DIV/0!"},{"$error":"#DIV/0!"},{"$error":"#DIV/0!"},{"$error":"#DIV/0!"},{"$error":"#DIV/0!"},{"$error":"#DIV/0!"},{"$error":"#DIV/0!"},{"$error":"#DIV/0!"},{"$error":"#DIV/0!"},{"$error":"#DIV/0!"},{"$error":"#DIV/0!"},{"$error":"#DIV/0!"},{"$error":"#DIV/0!"},{"$error":"#DIV/0!"},{"$error":"#DIV/0!"},-1716,0,-3,-1]

{"sheet":"Scale","index":11,"n_rows":32,"n_cols":25,"rows_kept":32,"cut":false,"hidden":true,"merged":[]}
["Indicador","Min","Bajo","Medio","Alto","Max","Dir","Dim","Sdim","Pdim","Psdim","Puntos","referencia",null,null,null,null,null,null,"Dimension","Puntos",null,"Subdimension"]
["P1B",0,10,20,30,40,0,"Planificación y Gestión Circular","Inversión",{"$f":"IF(H2=\"\",0,VLOOKUP(H2,$T$2:$U$8,2,FALSE))","v":20},{"$f":"IF(I2=\"\",0,VLOOKUP(I2,$W$2:$X$28,2,FALSE))","v":0.2},{"$f":"J2*K2","v":4},null,null,null,null,null,null,null,"Planificación y Gestión Circular",20,null,"Inversión",0.2,"Planificación y Gestión Circular"]
["P2B",0,25,50,75,100,0,"Planificación y Gestión Circular","Formación",20,0.05,{"$f":"J3*K3","v":1},null,null,null,null,null,null,null,"Energía",20,null,"Formación",0.05,"Planificación y Gestión Circular"]
["P3B",0,25,50,75,100,0,"Planificación y Gestión Circular","Compromiso circular de proveedores",20,0.05,1,null,null,null,null,null,null,null,"Agua",20,null,"Compromiso circular de proveedores",0.05,"Planificación y Gestión Circular"]
["P2_3B",0,25,50,75,100,0,"Planificación y Gestión Circular","Formación",20,0.05,1,null,null,null,null,null,null,null,"Residuos",20,null,"Buenas Prácticas Planifircación y Gestión Circular",0.7,"Planificación y Gestión Circular"]
["PBP",0,{"$f":"F6*0.25","v":4.75},{"$f":"F6*0.5","v":9.5},{"$f":"F6*0.75","v":14.25},19,0,"Planificación y Gestión Circular","Buenas Prácticas Planifircación y Gestión Circular",20,0.7,14,null,null,null,null,null,null,null,"Desperdicio Alimentario",20,null,"Consumo energético huella de carbono hab",0.1,"Energía"]
["E1B2",24.5,19,13.5,8,2.5,1,"Energía","Consumo energético huella de carbono hab",20,0.1,2,"Greenview","hab ocu",null,null,null,null,null,null,0,null,"Consumo energético huella de carbono m2",0.05,"Energía"]
["E1B3",85,70,55,40,25,1,"Energía","Certificación Energética Edificio",20,0.1,2,"Greenview","m2",null,null,null,null,null,"Nivel de Circularidad",{"$f":"SUM(U2:U6)","v":100},null,"Certificación Energética Edificio",0.1,"Energía"]
{"$rows_left_out":25}
{"sheet":"Hoja1","index":12,"n_rows":0,"n_cols":0,"rows_kept":0,"cut":false,"hidden":true,"merged":[]}